There is a problem compiling RB450G

hi all

Does anyone have any suggestions?

drivers/mtd/nand/rb4xx_nand.c: In function 'rb4xx_nand_remove':
drivers/mtd/nand/rb4xx_nand.c:359:27: error: expected ';' before ')' token
  nand_release(&info->chip));
                           ^
                           ;
drivers/mtd/nand/rb4xx_nand.c:359:27: error: expected statement before ')' token
scripts/Makefile.build:326: recipe for target 'drivers/mtd/nand/rb4xx_nand.o' failed
make[8]: *** [drivers/mtd/nand/rb4xx_nand.o] Error 1
scripts/Makefile.build:585: recipe for target 'drivers/mtd/nand' failed
make[7]: *** [drivers/mtd/nand] Error 2
scripts/Makefile.build:585: recipe for target 'drivers/mtd' failed
make[6]: *** [drivers/mtd] Error 2
Makefile:1053: recipe for target 'drivers' failed
make[5]: *** [drivers] Error 2
make[5]: Leaving directory '/home/along/lede-master/build_dir/target-mips_24kc_musl/linux-ar71xx_mikrotik/linux-4.14.195'
Makefile:24: recipe for target '/home/along/lede-master/build_dir/target-mips_24kc_musl/linux-ar71xx_mikrotik/linux-4.14.195/.image' failed
make[4]: *** [/home/along/lede-master/build_dir/target-mips_24kc_musl/linux-ar71xx_mikrotik/linux-4.14.195/.image] Error 2
make[4]: Leaving directory '/home/along/lede-master/target/linux/ar71xx'
Makefile:13: recipe for target 'install' failed
make[3]: *** [install] Error 2
make[3]: Leaving directory '/home/along/lede-master/target/linux'
time: target/linux/install#2.21#1.07#3.05
target/Makefile:23: recipe for target 'target/linux/install' failed
make[2]: *** [target/linux/install] Error 2
make[2]: Leaving directory '/home/along/lede-master'
target/Makefile:19: recipe for target '/home/along/lede-master/staging_dir/target-mips_24kc_musl/stamp/.target_install' failed
make[1]: *** [/home/along/lede-master/staging_dir/target-mips_24kc_musl/stamp/.target_install] Error 2
make[1]: Leaving directory '/home/along/lede-master'
/home/along/lede-master/include/toplevel.mk:222: recipe for target 'world' failed
make: *** [world] Error 2