Please help, wg1608-32m compilation error, thank you

make[5]: *** [Makefile:223: /home/joe/openwrt/build_dir/target-mipsel_24kc_musl/linux-ramips_mt7621/image-mt7621_zbtlink_zbt-wg1608-16m.dtb] Error 1
make[5]: Leaving directory '/home/joe/openwrt/target/linux/ramips/image'
make[4]: *** [Makefile:22: install] Error 2
make[4]: Leaving directory '/home/joe/openwrt/target/linux/ramips'
make[3]: *** [Makefile:11: install] Error 2
make[3]: Leaving directory '/home/joe/openwrt/target/linux'
time: target/linux/install#44.04#9.56#51.41
    ERROR: target/linux failed to build.
make[2]: *** [target/Makefile:30: target/linux/install] Error 1
make[2]: Leaving directory '/home/joe/openwrt'
make[1]: *** [target/Makefile:24: /home/joe/openwrt/staging_dir/target-mipsel_24kc_musl/stamp/.target_install] Error 2
make[1]: Leaving directory '/home/joe/openwrt'
make: *** [/home/joe/openwrt/include/toplevel.mk:230: world] Error 2
joe@ubuntu1:~/openwrt$

You will need to provide more info, try running make single-threaded and with full verbosity (make -j1 V=s).

make[4]: Entering directory '/home/joe/openwrt/build_dir/target-mipsel_24kc_musl/linux-ramips_mt7621/backports-5.15.33-1'
make[5]: 'Kconfig.versions' is up to date.
make[6]: 'conf' is up to date.
make[4]: Leaving directory '/home/joe/openwrt/build_dir/target-mipsel_24kc_musl/linux-ramips_mt7621/backports-5.15.33-1'
rm -rf /home/joe/openwrt/build_dir/target-mipsel_24kc_musl/linux-ramips_mt7621/backports-5.15.33-1/modules
make  -C "/home/joe/openwrt/build_dir/target-mipsel_24kc_musl/linux-ramips_mt7621/backports-5.15.33-1" KCFLAGS="-ffile-prefix-map=/home/joe/openwrt/build_dir/target-mipsel_24kc_musl=target-mipsel_24kc_musl" HOSTCFLAGS="-O2 -I/home/joe/openwrt/staging_dir/host/include -I/home/joe/openwrt/staging_dir/hostpkg/include -I/home/joe/openwrt/staging_dir/target-mipsel_24kc_musl/host/include -Wall -Wmissing-prototypes -Wstrict-prototypes" CROSS_COMPILE="mipsel-openwrt-linux-musl-" ARCH="mips" KBUILD_HAVE_NLS=no KBUILD_BUILD_USER="builder" KBUILD_BUILD_HOST="buildhost" KBUILD_BUILD_TIMESTAMP="Wed Apr 20 10:37:37 2022" KBUILD_BUILD_VERSION="0" HOST_LOADLIBES="-L/home/joe/openwrt/staging_dir/host/lib" KBUILD_HOSTLDLIBS="-L/home/joe/openwrt/staging_dir/host/lib" CONFIG_SHELL="bash" V=''  cmd_syscalls= KBUILD_EXTRA_SYMBOLS="/home/joe/openwrt/build_dir/target-mipsel_24kc_musl/linux-ramips_mt7621/symvers/acx-mac80211.symvers /home/joe/openwrt/build_dir/target-mipsel_24kc_musl/linux-ramips_mt7621/symvers/antfs.symvers /home/joe/openwrt/build_dir/target-mipsel_24kc_musl/linux-ramips_mt7621/symvers/ath10k-ct.symvers /home/joe/openwrt/build_dir/target-mipsel_24kc_musl/linux-ramips_mt7621/symvers/batman-adv.symvers /home/joe/openwrt/build_dir/target-mipsel_24kc_musl/linux-ramips_mt7621/symvers/button-hotplug.symvers /home/joe/openwrt/build_dir/target-mipsel_24kc_musl/linux-ramips_mt7621/symvers/cryptodev-linux.symvers /home/joe/openwrt/build_dir/target-mipsel_24kc_musl/linux-ramips_mt7621/symvers/dahdi-linux.symvers /home/joe/openwrt/build_dir/target-mipsel_24kc_musl/linux-ramips_mt7621/symvers/dmx_usb_module.symvers /home/joe/openwrt/build_dir/target-mipsel_24kc_musl/linux-ramips_mt7621/symvers/gl-mifi-mcu.symvers /home/joe/openwrt/build_dir/target-mipsel_24kc_musl/linux-ramips_mt7621/symvers/gpio-button-hotplug.symvers /home/joe/openwrt/build_dir/target-mipsel_24kc_musl/linux-ramips_mt7621/symvers/jool.symvers /home/joe/openwrt/build_dir/target-mipsel_24kc_musl/linux-ramips_mt7621/symvers/ksmbd.symvers /home/joe/openwrt/build_dir/target-mipsel_24kc_musl/linux-ramips_mt7621/symvers/mac80211.symvers /home/joe/openwrt/build_dir/target-mipsel_24kc_musl/linux-ramips_mt7621/symvers/macremapper.symvers /home/joe/openwrt/build_dir/target-mipsel_24kc_musl/linux-ramips_mt7621/symvers/mdio-netlink.symvers /home/joe/openwrt/build_dir/target-mipsel_24kc_musl/linux-ramips_mt7621/symvers/mt76.symvers /home/joe/openwrt/build_dir/target-mipsel_24kc_musl/linux-ramips_mt7621/symvers/mtd-rw.symvers /home/joe/openwrt/build_dir/target-mipsel_24kc_musl/linux-ramips_mt7621/symvers/nat46.symvers /home/joe/openwrt/build_dir/target-mipsel_24kc_musl/linux-ramips_mt7621/symvers/netatop.symvers /home/joe/openwrt/build_dir/target-mipsel_24kc_musl/linux-ramips_mt7621/symvers/openvswitch.symvers /home/joe/openwrt/build_dir/target-mipsel_24kc_musl/linux-ramips_mt7621/symvers/ovpn-dco.symvers /home/joe/openwrt/build_dir/target-mipsel_24kc_musl/linux-ramips_mt7621/symvers/rtl8812au-ct.symvers /home/joe/openwrt/build_dir/target-mipsel_24kc_musl/linux-ramips_mt7621/symvers/rtpengine.symvers /home/joe/openwrt/build_dir/target-mipsel_24kc_musl/linux-ramips_mt7621/symvers/siit.symvers /home/joe/openwrt/build_dir/target-mipsel_24kc_musl/linux-ramips_mt7621/symvers/trelay.symvers /home/joe/openwrt/build_dir/target-mipsel_24kc_musl/linux-ramips_mt7621/symvers/usb-serial-xr_usb_serial_common.symvers /home/joe/openwrt/build_dir/target-mipsel_24kc_musl/linux-ramips_mt7621/symvers/v4l2loopback.symvers /home/joe/openwrt/build_dir/target-mipsel_24kc_musl/linux-ramips_mt7621/symvers/xtables-addons.symvers" KERNELRELEASE=5.10.111 EXTRA_CFLAGS="-I/home/joe/openwrt/build_dir/target-mipsel_24kc_musl/linux-ramips_mt7621/backports-5.15.33-1/include -ffile-prefix-map=/home/joe/openwrt/build_dir/target-mipsel_24kc_musl/linux-ramips_mt7621/backports-5.15.33-1=backports-5.15.33-1 " KLIB_BUILD="/home/joe/openwrt/build_dir/target-mipsel_24kc_musl/linux-ramips_mt7621/linux-5.10.111" MODPROBE=true KLIB=/lib/modules/5.10.111 KERNEL_SUBLEVEL=10 KBUILD_LDFLAGS_MODULE_PREREQ= modules
make[4]: Entering directory '/home/joe/openwrt/build_dir/target-mipsel_24kc_musl/linux-ramips_mt7621/backports-5.15.33-1'
make[5]: 'Kconfig.versions' is up to date.
make[7]: 'Kconfig.versions' is up to date.
make[8]: 'conf' is up to date.
Building backport-include/backport/autoconf.h ... done.
make[6]: *** No rule to make target 'modules'.  Stop.
make[5]: *** [Makefile.real:93: modules] Error 2
make[4]: *** [Makefile:121: modules] Error 2
make[4]: Leaving directory '/home/joe/openwrt/build_dir/target-mipsel_24kc_musl/linux-ramips_mt7621/backports-5.15.33-1'
make[3]: *** [Makefile:559: /home/joe/openwrt/build_dir/target-mipsel_24kc_musl/linux-ramips_mt7621/backports-5.15.33-1/.built] Error 2
make[3]: Leaving directory '/home/joe/openwrt/package/kernel/mac80211'
time: package/kernel/mac80211/regular/compile#0.44#0.10#0.51
    ERROR: package/kernel/mac80211 failed to build (build variant: regular).
make[2]: *** [package/Makefile:116: package/kernel/mac80211/compile] Error 1
make[2]: Leaving directory '/home/joe/openwrt'
make[1]: *** [package/Makefile:110: /home/joe/openwrt/staging_dir/target-mipsel_24kc_musl/stamp/.package_compile] Error 2
make[1]: Leaving directory '/home/joe/openwrt'
make: *** [/home/joe/openwrt/include/toplevel.mk:230: world] Error 2