Build error custom build for Ruckus R500

Hey guys,

i had an r500 lying around at home and then i noticed the custom build. Unfortunately, there is an error that I can't fix myself. Maybe someone can give me a few tips on how to proceed.

custon build: Ruckus R500 openwrt 21.xx

Exportable Squashfs 4.0 filesystem, xz compressed, data block size 262144
        compressed data, compressed metadata, compressed fragments,
        no xattrs, compressed ids
        duplicates are removed
Filesystem size 3128.12 Kbytes (3.05 Mbytes)
        36.14% of uncompressed filesystem size (8654.60 Kbytes)
Inode table size 6164 bytes (6.02 Kbytes)
        19.68% of uncompressed inode table size (31328 bytes)
Directory table size 9210 bytes (8.99 Kbytes)
        46.07% of uncompressed directory table size (19991 bytes)
Number of duplicate files found 106
Number of inodes 942
Number of files 680
Number of fragments 18
Number of symbolic links  183
Number of device nodes 1
Number of fifo nodes 0
Number of socket nodes 0
Number of directories 78
Number of ids (unique uids + gids) 1
Number of uids 1
        root (0)
Number of gids 1
        root (0)
mkimage -A mips -O linux -T kernel -C lzma -a 0x80060000 -e 0x80060000 -n 'MIPS OpenWrt Linux-5.4.162'   -d /home/maxl95/Schreibtisch/openwrt-add_ruckus_r500/build_dir/target-mips_24kc_musl/linux-ath79_generic/ruckus_r500-kernel.bin /home/maxl95/Schreibtisch/openwrt-add_ruckus_r500/build_dir/target-mips_24kc_musl/linux-ath79_generic/
Image Name:   MIPS OpenWrt Linux-5.4.162
Created:      Sun Dec 12 13:49:44 2021
Image Type:   MIPS Linux Kernel Image (lzma compressed)
Data Size:    2085053 Bytes = 2036.18 KiB = 1.99 MiB
Load Address: 80060000
Entry Point:  80060000
mv /home/maxl95/Schreibtisch/openwrt-add_ruckus_r500/build_dir/target-mips_24kc_musl/linux-ath79_generic/ /home/maxl95/Schreibtisch/openwrt-add_ruckus_r500/build_dir/target-mips_24kc_musl/linux-ath79_generic/ruckus_r500-kernel.bin
/home/maxl95/Schreibtisch/openwrt-add_ruckus_r500/staging_dir/host/bin/ruckus_fw_header -i /home/maxl95/Schreibtisch/openwrt-add_ruckus_r500/build_dir/target-mips_24kc_musl/linux-ath79_generic/ruckus_r500-kernel.bin -o /home/maxl95/Schreibtisch/openwrt-add_ruckus_r500/build_dir/target-mips_24kc_musl/linux-ath79_generic/ruckus_r500-kernel.bin.out
bash: line 1: /home/maxl95/Schreibtisch/openwrt-add_ruckus_r500/staging_dir/host/bin/ruckus_fw_header: No such file or directory
make[5]: *** [Makefile:111: /home/maxl95/Schreibtisch/openwrt-add_ruckus_r500/build_dir/target-mips_24kc_musl/linux-ath79_generic/ruckus_r500-kernel.bin] Error 127
make[5]: Leaving directory '/home/maxl95/Schreibtisch/openwrt-add_ruckus_r500/target/linux/ath79/image'
make[4]: *** [Makefile:20: install] Error 2
make[4]: Leaving directory '/home/maxl95/Schreibtisch/openwrt-add_ruckus_r500/target/linux/ath79'
make[3]: *** [Makefile:11: install] Error 2
make[3]: Leaving directory '/home/maxl95/Schreibtisch/openwrt-add_ruckus_r500/target/linux'
time: target/linux/install#49.57#13.76#31.14
    ERROR: target/linux failed to build.
make[2]: *** [target/Makefile:30: target/linux/install] Error 1
make[2]: Leaving directory '/home/maxl95/Schreibtisch/openwrt-add_ruckus_r500'
make[1]: *** [target/Makefile:24: /home/maxl95/Schreibtisch/openwrt-add_ruckus_r500/staging_dir/target-mips_24kc_musl/stamp/.target_install] Error 2
make[1]: Leaving directory '/home/maxl95/Schreibtisch/openwrt-add_ruckus_r500'
make: *** [/home/maxl95/Schreibtisch/openwrt-add_ruckus_r500/include/ world] Fehler 2


seems you're missing something ...

So, i solved the problem

I had to compile the *.c file found here: mail-archiv and after that copy the binary to the specified path " openwrt-add_ruckus_r500/staging_dir/host/bin/".
Now the build is successful.

regards maxl95

This topic was automatically closed 10 days after the last reply. New replies are no longer allowed.